Target
DNA gyrase subunit B
Ligand
BDBM50046999
Substrate
Meas. Tech.
ChEMBL_1454592 (CHEMBL3366704)
IC50
<10.0±n/a nM
Citation
 Basarab, GSHill, PJGarner, CEHull, KGreen, OSherer, BADangel, PBManchester, JIBist, SHauck, SZhou, FUria-Nickelsen, MIllingworth, RAlm, RRooney, MEakin, AE Optimization of pyrrolamide topoisomerase II inhibitors toward identification of an antibacterial clinical candidate (AZD5099). J Med Chem 57:6060-82 (2014)  
Target
Name:
DNA gyrase subunit B
Synonyms:
DNA gyrase DNA gyrase subunit B (gyrB) gyrB
Type:
Enzyme Subunit
Mol. Mass.:
72530.91
Organism:
Staphylococcus aureus
Description:
Residue:
644
  
Inhibitor
Name:
BDBM50046999
Synonyms:
CHEMBL3314549
Type:
Small organic molecule
Emp. Form.:
C17H20Cl2N4O4S
Mol. Mass.:
447.336
SMILES:
CO[C@H]1CN(CC[C@H]1NC(=O)c1[nH]c(C)c(Cl)c1Cl)c1nc(C)c(s1)C(O)=O
: