Target
Toxin ParE
Ligand
BDBM50047215
Substrate
Meas. Tech.
ChEMBL_1454591 (CHEMBL3366703)
IC50
51±n/a nM
Citation
 Basarab, GSHill, PJGarner, CEHull, KGreen, OSherer, BADangel, PBManchester, JIBist, SHauck, SZhou, FUria-Nickelsen, MIllingworth, RAlm, RRooney, MEakin, AE Optimization of pyrrolamide topoisomerase II inhibitors toward identification of an antibacterial clinical candidate (AZD5099). J Med Chem 57:6060-82 (2014)  
Target
Name:
Toxin ParE
Synonyms:
Gyrase inhibitor ParE Toxin ParE | parE
Type:
PROTEIN
Mol. Mass.:
11720.14
Organism:
Escherichia coli
Description:
ChEMBL_109450
Residue:
103
  
Inhibitor
Name:
BDBM50047215
Synonyms:
CHEMBL3314567
Type:
Small organic molecule
Emp. Form.:
C22H29Cl2N5O7S
Mol. Mass.:
578.466
SMILES:
COCC(COC)NC(=O)c1nc(sc1C(O)=O)N1CC[C@@H](NC(=O)c2[nH]c(C)c(Cl)c2Cl)[C@H](C1)OC
: