Target
ATP-binding cassette sub-family C member 2
Ligand
BDBM50047309
Substrate
Meas. Tech.
ChEMBL_1455464 (CHEMBL3363896)
IC50
>200000±n/a nM
Citation
 Basarab, GSHill, PJGarner, CEHull, KGreen, OSherer, BADangel, PBManchester, JIBist, SHauck, SZhou, FUria-Nickelsen, MIllingworth, RAlm, RRooney, MEakin, AE Optimization of pyrrolamide topoisomerase II inhibitors toward identification of an antibacterial clinical candidate (AZD5099). J Med Chem 57:6060-82 (2014)  
Target
Name:
ATP-binding cassette sub-family C member 2
Synonyms:
ATP-binding cassette sub-family C member 2 Canalicular multidrug resistance protein Cmoat MRP2_RAT Multidrug resistance-associated protein 2
Type:
PROTEIN
Mol. Mass.:
173415.22
Organism:
Rattus norvegicus
Description:
ChEMBL_1455464
Residue:
1541
  
Inhibitor
Name:
BDBM50047309
Synonyms:
CHEMBL3314576
Type:
Small organic molecule
Emp. Form.:
C19H21Cl2N7O4S
Mol. Mass.:
514.386
SMILES:
CO[C@H]1CN(CC[C@H]1NC(=O)c1[nH]c(C)c(Cl)c1Cl)c1nc(c(s1)C(O)=O)-c1ncnn1C
: