Target
Retinoic acid receptor RXR-alpha
Ligand
BDBM50047350
Substrate
Meas. Tech.
ChEMBL_1456363 (CHEMBL3368372)
EC50
780±n/a nM
Citation
 Inoue, MTanabe, HNakashima, KIshida, YKotani, H Rexinoids isolated from Sophora tonkinensis with a gene expression profile distinct from the synthetic rexinoid bexarotene. J Nat Prod 77:1670-7 (2014)  
Target
Name:
Retinoic acid receptor RXR-alpha
Synonyms:
NR2B1 Nuclear receptor subfamily 4 group A member 2 RXRA Retinoic acid receptor RXR-alpha/gamma Retinoid receptor
Type:
PROTEIN
Mol. Mass.:
50820.38
Organism:
Homo sapiens (Human)
Description:
ChEMBL_1456363
Residue:
462
  
Inhibitor
Name:
BDBM50047350
Synonyms:
CHEMBL3314593
Type:
Small organic molecule
Emp. Form.:
C30H36O5
Mol. Mass.:
476.6038
SMILES:
[#6]\[#6](-[#6])=[#6]\[#6]-c1cc(cc2-[#6]-[#6](-[#8])C([#6])([#6])[#8]-c12)-[#6@@H]-1-[#6]-[#6](=O)-c2ccc(-[#8])c(-[#6]\[#6]=[#6](\[#6])-[#6])c2-[#8]-1
: