Target
Papain
Ligand
BDBM50048080
Substrate
Meas. Tech.
ChEMBL_1453723 (CHEMBL3364438)
IC50
710±n/a nM
Citation
 Wammes, AEHendriks, TGAmatdjais-Groenen, HIWijdeven, MAvan Hest, JCvan Delft, FLRitschel, TRutjes, FP Influence of azide incorporation on binding affinity by small papain inhibitors. Bioorg Med Chem 22:5593-603 (2014)  
Target
Name:
Papain
Synonyms:
Allergen=Car p 1 PPI | Papaya proteinase I
Type:
Enzyme
Mol. Mass.:
38923.01
Organism:
Carica papaya
Description:
Papain was purchased from Sigma, Germany.
Residue:
345
  
Inhibitor
Name:
BDBM50048080
Synonyms:
CHEMBL3357956
Type:
Small organic molecule
Emp. Form.:
C20H20N6O2
Mol. Mass.:
376.4118
SMILES:
[N-]=[N+]=NCc1ccc(cc1)C(=O)N[C@@H](CCc1ccccc1)C(=O)NCC#N
: