Target
Sucrase-isomaltase, intestinal
Ligand
BDBM50263044
Substrate
Meas. Tech.
ChEMBL_1454615 (CHEMBL3366727)
IC50
5200±n/a nM
Citation
 Natori, YSakuma, TYoshimura, YKinami, KHirokami, YSato, KAdachi, IKato, ATakahata, H Synthesis and biological evaluation ofa-1-C-4'-arylbutyl-L-arabinoiminofuranoses, a new class ofa-glucosidase inhibitors. Bioorg Med Chem Lett 24:3298-301 (2014)  
Target
Name:
Sucrase-isomaltase, intestinal
Synonyms:
SUIS_RAT Sucrase-isomaltase | alpha-Glucosidase (α-Glucosidase)
Type:
Enzyme
Mol. Mass.:
210329.04
Organism:
Rattus norvegicus (Rat)
Description:
P23739
Residue:
1841
  
Inhibitor
Name:
BDBM50263044
Synonyms:
CHEMBL476960 | Voglibose
Type:
Small organic molecule
Emp. Form.:
C10H21NO7
Mol. Mass.:
267.2762
SMILES:
OCC(CO)N[C@H]1C[C@](O)(CO)[C@@H](O)[C@H](O)[C@H]1O
: