Target
Galectin-1
Ligand
BDBM50048096
Substrate
Meas. Tech.
ChEMBL_1454622 (CHEMBL3361811)
Kd
650000±n/a nM
Citation
 Rajput, VKLeffler, HNilsson, UJMukhopadhyay, B Synthesis and evaluation of iminocoumaryl and coumaryl derivatized glycosides as galectin antagonists. Bioorg Med Chem Lett 24:3516-20 (2014)  
Target
Name:
Galectin-1
Synonyms:
14 kDa lectin HPL LGALS1 Lectin galactoside-binding soluble 1 | Putative MAPK-activating protein PM12
Type:
beta galactoside-binding protein
Mol. Mass.:
14713.53
Organism:
Homo sapiens (Human)
Description:
P09382
Residue:
135
  
Inhibitor
Name:
BDBM50048096
Synonyms:
CHEMBL3311524
Type:
Small organic molecule
Emp. Form.:
C23H25NO9S
Mol. Mass.:
491.511
SMILES:
CO[C@H]1O[C@H](CO)[C@H](O)[C@H](OCc2cc3ccccc3o\c2=N/S(=O)(=O)c2ccccc2)[C@H]1O
: