Target
Galectin-7
Ligand
BDBM50048095
Substrate
Meas. Tech.
ChEMBL_1454624 (CHEMBL3361813)
Kd
180000±n/a nM
Citation
 Rajput, VKLeffler, HNilsson, UJMukhopadhyay, B Synthesis and evaluation of iminocoumaryl and coumaryl derivatized glycosides as galectin antagonists. Bioorg Med Chem Lett 24:3516-20 (2014)  
Target
Name:
Galectin-7
Synonyms:
Gal-7 LEG7_HUMAN PI7 p53-induced gene 1 protein
Type:
Galactoside-binding protein
Mol. Mass.:
15077.89
Organism:
Homo sapiens (Human)
Description:
Residue:
136
  
Inhibitor
Name:
BDBM50048095
Synonyms:
CHEMBL3311523
Type:
Small organic molecule
Emp. Form.:
C26H29NO10S
Mol. Mass.:
547.574
SMILES:
CO[C@H]1O[C@H](CO)[C@H](O)[C@H](OCc2cc3ccccc3o\c2=N/S(=O)(=O)c2ccc(C)cc2)[C@H]1OC(C)=O
: