Target
cAMP and cAMP-inhibited cGMP 3',5'-cyclic phosphodiesterase 10A
Ligand
BDBM50048261
Substrate
Meas. Tech.
ChEMBL_1458264 (CHEMBL3368979)
IC50
4.1±n/a nM
Citation
 Das, SShelke, DEHarde, RLAvhad, VBKhairatkar-Joshi, NGullapalli, SGupta, PKGandhi, MNBhateja, DKBajpai, MJoshi, AAMarathe, MYGudi, GSJadhav, SBMahat, MYThomas, A Design, synthesis and pharmacological evaluation of novel polycyclic heteroarene ethers as PDE10A inhibitors: part II. Bioorg Med Chem Lett 24:3238-42 (2014)  
Target
Name:
cAMP and cAMP-inhibited cGMP 3',5'-cyclic phosphodiesterase 10A
Synonyms:
PDE10_MOUSE | Pde10a
Type:
PROTEIN
Mol. Mass.:
89407.64
Organism:
Mus musculus
Description:
ChEMBL_1458264
Residue:
790
  
Inhibitor
Name:
BDBM50048261
Synonyms:
CHEMBL3315044
Type:
Small organic molecule
Emp. Form.:
C24H18N4O
Mol. Mass.:
378.4259
SMILES:
Cn1cc(-c2ccc(Oc3ncccc3-c3ccncc3)cc2)c2ncccc12
: