Target
40S ribosomal protein S27
Ligand
BDBM50048362
Substrate
Meas. Tech.
ChEMBL_1446775 (CHEMBL3381090)
IC50
>10000±n/a nM
Citation
 Casale, EAmboldi, NBrasca, MGCaronni, DColombo, NDalvit, CFelder, ERFogliatto, GGalvani, AIsacchi, APolucci, PRiceputi, LSola, FVisco, CZuccotto, FCasuscelli, F Fragment-based hit discovery and structure-based optimization of aminotriazoloquinazolines as novel Hsp90 inhibitors. Bioorg Med Chem 22:4135-50 (2014)  
Target
Name:
40S ribosomal protein S27
Synonyms:
MPS-1 Metallopan-stimulin 1 RS27_HUMAN
Type:
PROTEIN
Mol. Mass.:
9472.13
Organism:
Homo sapiens (Human)
Description:
ChEMBL_1446775
Residue:
84
  
Inhibitor
Name:
BDBM50048362
Synonyms:
CHEMBL3309995
Type:
Small organic molecule
Emp. Form.:
C17H14N6O2
Mol. Mass.:
334.3321
SMILES:
Nc1nc2c3ccc(N)cc3nc(Cc3ccc4OCOc4c3)n2n1
: