Target
Serine/threonine-protein kinase tousled-like 2
Ligand
BDBM50048365
Substrate
Meas. Tech.
ChEMBL_1446792 (CHEMBL3371266)
IC50
>10000±n/a nM
Citation
 Casale, EAmboldi, NBrasca, MGCaronni, DColombo, NDalvit, CFelder, ERFogliatto, GGalvani, AIsacchi, APolucci, PRiceputi, LSola, FVisco, CZuccotto, FCasuscelli, F Fragment-based hit discovery and structure-based optimization of aminotriazoloquinazolines as novel Hsp90 inhibitors. Bioorg Med Chem 22:4135-50 (2014)  
Target
Name:
Serine/threonine-protein kinase tousled-like 2
Synonyms:
Serine/threonine-protein kinase tousled-like 2 TLK2_HUMAN
Type:
PROTEIN
Mol. Mass.:
87680.67
Organism:
Homo sapiens (Human)
Description:
ChEMBL_1510767
Residue:
772
  
Inhibitor
Name:
BDBM50048365
Synonyms:
CHEMBL3309998
Type:
Small organic molecule
Emp. Form.:
C19H18N6O3
Mol. Mass.:
378.3846
SMILES:
Nc1nc2c3ccc(NCCO)cc3nc(Cc3ccc4OCOc4c3)n2n1
: