Target
High affinity immunoglobulin gamma Fc receptor I
Ligand
BDBM50048365
Substrate
Meas. Tech.
ChEMBL_1446762 (CHEMBL3381077)
IC50
>10000±n/a nM
Citation
 Casale, EAmboldi, NBrasca, MGCaronni, DColombo, NDalvit, CFelder, ERFogliatto, GGalvani, AIsacchi, APolucci, PRiceputi, LSola, FVisco, CZuccotto, FCasuscelli, F Fragment-based hit discovery and structure-based optimization of aminotriazoloquinazolines as novel Hsp90 inhibitors. Bioorg Med Chem 22:4135-50 (2014)  
Target
Name:
High affinity immunoglobulin gamma Fc receptor I
Synonyms:
FCG1 FCGR1A IGFR1
Type:
PROTEIN
Mol. Mass.:
42639.35
Organism:
Homo sapiens (Human)
Description:
ChEMBL_1446762
Residue:
374
  
Inhibitor
Name:
BDBM50048365
Synonyms:
CHEMBL3309998
Type:
Small organic molecule
Emp. Form.:
C19H18N6O3
Mol. Mass.:
378.3846
SMILES:
Nc1nc2c3ccc(NCCO)cc3nc(Cc3ccc4OCOc4c3)n2n1
: