Target
Phosphatidylinositol 4,5-bisphosphate 3-kinase catalytic subunit beta isoform
Ligand
BDBM50048709
Substrate
Meas. Tech.
ChEMBL_1451091 (CHEMBL3366868)
IC50
8.0±n/a nM
Citation
 Barlaam, BCosulich, SDegorce, SFitzek, MGiordanetto, FGreen, SInghardt, THennequin, LHancox, ULambert-van der Brempt, CMorgentin, RPass, SPlé, PSaleh, TWard, L Discovery of 9-(1-anilinoethyl)-2-morpholino-4-oxo-pyrido[1,2-a]pyrimidine-7-carboxamides as PI3Kß/d inhibitors for the treatment of PTEN-deficient tumours. Bioorg Med Chem Lett 24:3928-35 (2014)  
Target
Name:
Phosphatidylinositol 4,5-bisphosphate 3-kinase catalytic subunit beta isoform
Synonyms:
PI3-kinase p110 subunit beta PI3Kbeta PIK3CB Phosphatidylinositol 4,5-bisphosphate 3-kinase catalytic subunit beta (PI3Kbeta) Phosphatidylinositol 4,5-bisphosphate 3-kinase catalytic subunit beta isoform (PI3K) Phosphatidylinositol 4,5-bisphosphate 3-kinase catalytic subunit beta isoform (PI3Kbeta) Phosphatidylinositol-4,5-bisphosphate 3-kinase catalytic subunit beta isoform Phosphoinositide 3-Kinase (PI3K), beta Chain A PtdIns-3-kinase p110
Type:
Enzyme Subunit
Mol. Mass.:
122769.00
Organism:
Homo sapiens (Human)
Description:
P42338
Residue:
1070
  
Inhibitor
Name:
BDBM50048709
Synonyms:
CHEMBL3318715
Type:
Small organic molecule
Emp. Form.:
C25H32N6O3
Mol. Mass.:
464.56
SMILES:
CC(Nc1ccccc1)c1cc(cn2c1nc(cc2=O)N1CCOCC1)C(=O)NCCN(C)C
: