Target
Proto-oncogene tyrosine-protein kinase ROS
Ligand
BDBM50048851
Substrate
Meas. Tech.
ChEMBL_1452909 (CHEMBL3366561)
IC50
139±n/a nM
Citation
 Park, BSAl-Sanea, MMAbdelazem, AZPark, HMRoh, EJPark, HMYoo, KHSim, TTae, JSLee, SH Structure-based optimization and biological evaluation of trisubstituted pyrazole as a core structure of potent ROS1 kinase inhibitors. Bioorg Med Chem 22:3871-8 (2014)  
Target
Name:
Proto-oncogene tyrosine-protein kinase ROS
Synonyms:
MCF3 Proto-oncogene c-Ros-1 ROS1 Receptor tyrosine kinase c-ros oncogene 1 c-Ros receptor tyrosine kinase
Type:
Enzyme
Mol. Mass.:
263897.39
Organism:
Homo sapiens (Human)
Description:
P08922
Residue:
2347
  
Inhibitor
Name:
BDBM50048851
Synonyms:
CHEMBL3310504
Type:
Small organic molecule
Emp. Form.:
C23H24N6O2
Mol. Mass.:
416.4757
SMILES:
C[C@H](O)CNc1cc(nc(n1)-c1cccnc1)-c1cnn(C)c1-c1cc(C)cc(O)c1
: