Target
Histone deacetylase 4
Ligand
BDBM50048859
Substrate
Meas. Tech.
ChEMBL_1452941 (CHEMBL3366593)
IC50
>100000±n/a nM
Citation
 Hoque, MAIslam, MNIslam, MSKato, TNishino, NIto, AYoshida, M Design and synthesis of CHAP31, trapoxin B and HC-toxin based bicyclic tetrapeptides disulfide as potent histone deacetylase inhibitors. Bioorg Med Chem 22:3850-5 (2014)  
Target
Name:
Histone deacetylase 4
Synonyms:
Cereblon/Histone deacetylase 4 HDAC4 Histone acetylase 4(HDAC4) KIAA0288
Type:
Enzyme
Mol. Mass.:
119049.39
Organism:
Homo sapiens (Human)
Description:
P56524
Residue:
1084
  
Inhibitor
Name:
BDBM50048859
Synonyms:
CHEMBL3310507
Type:
Small organic molecule
Emp. Form.:
C24H40N4O4S2
Mol. Mass.:
512.729
SMILES:
[H][C@]12CCCN1C(=O)[C@@H](NC(=O)[C@@]1([H])CCCCCSSCCCCC[C@]([H])(NC2=O)C(=O)N1)C(C)C
: