Target
Protein kinase C theta type
Ligand
BDBM50049434
Substrate
Meas. Tech.
ChEMBL_1454725 (CHEMBL3362644)
IC50
230±n/a nM
Citation
 George, DMBreinlinger, ECFriedman, MZhang, YWang, JArgiriadi, MBansal-Pakala, PBarth, MDuignan, DBHonore, PLang, QMittelstadt, SPotin, DRundell, LEdmunds, JJ Discovery of selective and orally bioavailable protein kinase C¿ (PKC¿) inhibitors from a fragment hit. J Med Chem 58:222-36 (2015)  
Target
Name:
Protein kinase C theta type
Synonyms:
KPCT_HUMAN PRKCT Protein kinase C theta type (PRKCQ) nPKC-theta
Type:
Serine/threonine-protein kinase
Mol. Mass.:
81878.04
Organism:
Homo sapiens (Human)
Description:
Full-length human PKC theta (Panvera Catalog No. P2996).
Residue:
706
  
Inhibitor
Name:
BDBM50049434
Synonyms:
CHEMBL3356461
Type:
Small organic molecule
Emp. Form.:
C14H17N5O2
Mol. Mass.:
287.3171
SMILES:
CC1N2C(COc3ccc(NC4CNC4)cc23)=NNC1=O
: