Target
Monoglyceride lipase
Ligand
BDBM50049456
Substrate
Meas. Tech.
ChEMBL_1450299 (CHEMBL3377010)
IC50
10.0±n/a nM
Citation
 Afzal, OKumar, SKumar, RFiroz, AJaggi, MBawa, S Docking based virtual screening and molecular dynamics study to identify potential monoacylglycerol lipase inhibitors. Bioorg Med Chem Lett 24:3986-96 (2014)  
Target
Name:
Monoglyceride lipase
Synonyms:
HU-K5 Lysophospholipase-like MGL MGLL_HUMAN
Type:
Hydrolase
Mol. Mass.:
33264.56
Organism:
Homo sapiens (Human)
Description:
Human recombinant MGL (Cayman Chemical, cat# 10008354).
Residue:
303
  
Inhibitor
Name:
BDBM50049456
Synonyms:
CHEMBL3318318
Type:
Small organic molecule
Emp. Form.:
C21H15N5OS
Mol. Mass.:
385.442
SMILES:
O=C(Cn1nnc2ccccc12)Nc1ccc(cc1)-c1nc2ccccc2s1
: