Target
Aurora kinase B
Ligand
BDBM50050856
Substrate
Meas. Tech.
ChEMBL_1459266 (CHEMBL3367496)
IC50
714±n/a nM
Citation
 Defaux, JAntoine, MLogé, CLe Borgne, MSchuster, TSeipelt, IAicher, BTeifel, MGünther, EGerlach, MMarchand, P Discovery of (7-aryl-1,5-naphthyridin-2-yl)ureas as dual inhibitors of ERK2 and Aurora B kinases with antiproliferative activity against cancer cells. Bioorg Med Chem Lett 24:3748-52 (2014)  
Target
Name:
Aurora kinase B
Synonyms:
AIK2 AIM1 ARK2 AURKB_HUMAN Aurora B-INCENP Aurora kinase B (AURKB) STK-1 STK12 Serine/threonine-protein kinase aurora B
Type:
Protein
Mol. Mass.:
39327.72
Organism:
Homo sapiens (Human)
Description:
Q96GD4
Residue:
344
  
Inhibitor
Name:
BDBM50050856
Synonyms:
CHEMBL3318009
Type:
Small organic molecule
Emp. Form.:
C21H24N4O3
Mol. Mass.:
380.4403
SMILES:
COc1ccc(cc1OC)-c1cnc2c(NC(=O)NC(C)(C)C)ccnc2c1
: