Target
Mitogen-activated protein kinase 1
Ligand
BDBM50050853
Substrate
Meas. Tech.
ChEMBL_1459265 (CHEMBL3367495)
IC50
30±n/a nM
Citation
 Defaux, JAntoine, MLogé, CLe Borgne, MSchuster, TSeipelt, IAicher, BTeifel, MGünther, EGerlach, MMarchand, P Discovery of (7-aryl-1,5-naphthyridin-2-yl)ureas as dual inhibitors of ERK2 and Aurora B kinases with antiproliferative activity against cancer cells. Bioorg Med Chem Lett 24:3748-52 (2014)  
Target
Name:
Mitogen-activated protein kinase 1
Synonyms:
ERK2 Extracellular signal-regulated kinase 2 Extracellular signal-regulated kinase 2 (ERK2) MAPK 2 MK01_HUMAN Mitogen-activated protein kinase 1 (ERK-2) Mitogen-activated protein kinase 2 PRKM2 | p42-MAPK
Type:
Ser/Thr Protein Kinase
Mol. Mass.:
41392.76
Organism:
Homo sapiens (Human)
Description:
P28482
Residue:
360
  
Inhibitor
Name:
BDBM50050853
Synonyms:
CHEMBL3318029
Type:
Small organic molecule
Emp. Form.:
C20H18N6O
Mol. Mass.:
358.3965
SMILES:
Cn1cc(cn1)-c1cnc2ccc(NC(=O)NCc3ccccc3)nc2c1
: