Target
Adenosylhomocysteinase
Ligand
BDBM50050883
Substrate
Meas. Tech.
ChEMBL_1459288 (CHEMBL3367518)
IC50
81±n/a nM
Citation
 Nakao, ASuzuki, HUeno, HIwasaki, HSetsuta, T Discovery of S-adenosyl-L-homocysteine hydrolase inhibitors based on non-adenosine analogs. Bioorg Med Chem Lett 24:4336-40 (2014)  
Target
Name:
Adenosylhomocysteinase
Synonyms:
AHCY SAHH | SAHH_HUMAN
Type:
PROTEIN
Mol. Mass.:
47714.06
Organism:
Homo sapiens (Human)
Description:
ChEMBL_1507791
Residue:
432
  
Inhibitor
Name:
BDBM50050883
Synonyms:
CHEMBL3322541
Type:
Small organic molecule
Emp. Form.:
C33H38Cl2N4O3
Mol. Mass.:
609.586
SMILES:
CN(C1CCc2ccccc2C1)C(=O)CN(CC(=O)NCCN1CCCC1)c1cc(Cl)ccc1Oc1ccc(Cl)cc1
: