Target
Sodium channel protein type 2 subunit alpha
Ligand
BDBM50051079
Substrate
Meas. Tech.
ChEMBL_1448649 (CHEMBL3371414)
IC50
33±n/a nM
Citation
 Park, JHCarlin, KPWu, GIlyin, VIMusza, LLBlake, PRKyle, DJ Studies examining the relationship between the chemical structure of protoxin II and its activity on voltage gated sodium channels. J Med Chem 57:6623-31 (2014)  
Target
Name:
Sodium channel protein type 2 subunit alpha
Synonyms:
SCN2A_RAT Scn2a1 Sodium channel protein type 2 subunit alpha Sodium channel protein type II subunit alpha Voltage-gated sodium channel | Voltage-gated sodium channel subunit alpha Nav1.2
Type:
PROTEIN
Mol. Mass.:
227854.11
Organism:
Rattus norvegicus
Description:
ChEMBL_1516893
Residue:
2005
  
Inhibitor
Name:
BDBM50051079
Synonyms:
CHEMBL3318138
Type:
Small organic molecule
Emp. Form.:
C173H261N47O40S7
Mol. Mass.:
3863.669
SMILES:
[H][C@]12CSSC[C@]3([H])NC(=O)[C@@]([H])(NC(=O)[C@H](Cc4c[nH]c5ccccc45)NC(=O)[C@H](CCSC)NC(=O)[C@H](Cc4c[nH]c5ccccc45)NC(=O)[C@H](CCCCN)NC(=O)[C@H](CCC(N)=O)NC(=O)[C@H](CSSC[C@]([H])(NC(=O)[C@]([H])(CSSC[C@H](NC(=O)[C@H](Cc4c[nH]c5ccccc45)NC(=O)[C@H](CC(C)C)NC(=O)[C@H](CCCNC(N)=N)NC1=O)C(=O)N[C@@H](CCCCN)C(=O)N[C@@H](CCCCN)C(=O)N[C@@H](CCCCN)C(=O)N[C@@H]([C@@H](C)CC)C(=O)N[C@@H](CC(C)C)C(=O)N[C@@H](Cc1c[nH]c4ccccc14)C(O)=O)NC(=O)[C@H](CCCCN)NC(=O)[C@H](CCCNC(N)=N)NC(=O)[C@H](C)NC(=O)[C@H](CO)NC(=O)[C@H](CC(O)=O)NC3=O)C(=O)N[C@@H](CCC(O)=O)C(=O)NCC(=O)N[C@@H](CC(C)C)C(=O)N[C@@H](C(C)C)C(=O)N2)NC(=O)[C@@H](N)Cc1ccc(O)cc1)[C@@H](C)O
: