Target
Protein arginine N-methyltransferase 5
Ligand
BDBM50051117
Substrate
Meas. Tech.
ChEMBL_1450371 (CHEMBL3378208)
IC50
>100000±n/a nM
Citation
 Ma, AYu, WLi, FBleich, RMHerold, JMButler, KVNorris, JLKorboukh, VTripathy, AJanzen, WPArrowsmith, CHFrye, SVVedadi, MBrown, PJJin, J Discovery of a selective, substrate-competitive inhibitor of the lysine methyltransferase SETD8. J Med Chem 57:6822-33 (2014)  
Target
Name:
Protein arginine N-methyltransferase 5
Synonyms:
72 kDa ICln-binding protein HRMT1L5 IBP72 Jak-binding protein 1 PRMT5/MEP50 complex Protein arginine methyltransferase 5 (PRMT5) SKB1 homolog Shk1 kinase-binding protein 1 homolog
Type:
Enzyme
Mol. Mass.:
72679.99
Organism:
Homo sapiens (Human)
Description:
O14744
Residue:
637
  
Inhibitor
Name:
BDBM50051117
Synonyms:
CHEMBL3318285
Type:
Small organic molecule
Emp. Form.:
C23H35N5O2
Mol. Mass.:
413.5563
SMILES:
COc1cc2nc(nc(NCCCCCN3CCCC3)c2cc1OC)N1CCCC1
: