Target
Polyunsaturated fatty acid 5-lipoxygenase
Ligand
BDBM50051933
Substrate
Meas. Tech.
ChEMBL_1453015 (CHEMBL3362097)
IC50
1200±n/a nM
Citation
 Rödl, CBVogt, DKretschmer, SBIhlefeld, KBarzen, SBrüggerhoff, AAchenbach, JProschak, ESteinhilber, DStark, HHofmann, B Multi-dimensional target profiling of N,4-diaryl-1,3-thiazole-2-amines as potent inhibitors of eicosanoid metabolism. Eur J Med Chem 84:302-11 (2014)  
Target
Name:
Polyunsaturated fatty acid 5-lipoxygenase
Synonyms:
5-LO 5-Lipoxygenase (5-LO) 5-Lipoygenase ALOX5 LOG5 | LOX5_HUMAN
Type:
Enzyme
Mol. Mass.:
77972.74
Organism:
Homo sapiens (Human)
Description:
Recombinant protein was purified from E. coli lysate. After ammonium sulfate precipitation and subsequent steps, the supernatant (S100) was used for 5-LO activity assay.
Residue:
674
  
Inhibitor
Name:
BDBM50051933
Synonyms:
CHEMBL1087624
Type:
Small organic molecule
Emp. Form.:
C15H11ClN2OS
Mol. Mass.:
302.779
SMILES:
Oc1cccc(Nc2nc(cs2)-c2ccc(Cl)cc2)c1
: