Target
Acetylcholinesterase
Ligand
BDBM50052207
Substrate
Meas. Tech.
ChEMBL_1455650 (CHEMBL3365679)
IC50
15±n/a nM
Citation
 Akrami, HMirjalili, BFKhoobi, MNadri, HMoradi, ASakhteman, AEmami, SForoumadi, AShafiee, A Indolinone-based acetylcholinesterase inhibitors: synthesis, biological activity and molecular modeling. Eur J Med Chem 84:375-81 (2014)  
Target
Name:
Acetylcholinesterase
Synonyms:
ACES_ELEEL Acetylcholinesterase (EeAChE) | ache
Type:
Enzyme
Mol. Mass.:
71812.79
Organism:
Electrophorus electricus (Electric eel)
Description:
Residue:
633
  
Inhibitor
Name:
BDBM50052207
Synonyms:
CHEMBL3318393
Type:
Small organic molecule
Emp. Form.:
C22H19ClN2O
Mol. Mass.:
362.852
SMILES:
[Cl-].Cc1ccccc1C[n+]1ccc(\C=C2\C(=O)Nc3ccccc23)cc1
: