Target
Acetylcholinesterase
Ligand
BDBM50052218
Substrate
Meas. Tech.
ChEMBL_1455650 (CHEMBL3365679)
IC50
590±n/a nM
Citation
 Akrami, HMirjalili, BFKhoobi, MNadri, HMoradi, ASakhteman, AEmami, SForoumadi, AShafiee, A Indolinone-based acetylcholinesterase inhibitors: synthesis, biological activity and molecular modeling. Eur J Med Chem 84:375-81 (2014)  
Target
Name:
Acetylcholinesterase
Synonyms:
ACES_ELEEL Acetylcholinesterase (EeAChE) | ache
Type:
Enzyme
Mol. Mass.:
71812.79
Organism:
Electrophorus electricus (Electric eel)
Description:
Residue:
633
  
Inhibitor
Name:
BDBM50052218
Synonyms:
CHEMBL3318406
Type:
Small organic molecule
Emp. Form.:
C21H16Cl2N2O
Mol. Mass.:
383.271
SMILES:
[Cl-].Clc1ccc(C[n+]2ccc(\C=C3\C(=O)Nc4ccccc34)cc2)cc1
: