Target
Cholinesterase
Ligand
BDBM50052205
Substrate
Meas. Tech.
ChEMBL_1455651 (CHEMBL3365680)
IC50
4300±n/a nM
Citation
 Akrami, HMirjalili, BFKhoobi, MNadri, HMoradi, ASakhteman, AEmami, SForoumadi, AShafiee, A Indolinone-based acetylcholinesterase inhibitors: synthesis, biological activity and molecular modeling. Eur J Med Chem 84:375-81 (2014)  
Target
Name:
Cholinesterase
Synonyms:
BCHE CHLE_HORSE | Cholinesterase
Type:
Enzyme
Mol. Mass.:
65643.35
Organism:
Equus caballus (Horse)
Description:
P81908
Residue:
574
  
Inhibitor
Name:
BDBM50052205
Synonyms:
CHEMBL3318390
Type:
Small organic molecule
Emp. Form.:
C21H17BrN2O
Mol. Mass.:
393.276
SMILES:
[Br-].O=C1Nc2ccccc2\C1=C/c1cc[n+](Cc2ccccc2)cc1
: