Target
Cholinesterase
Ligand
BDBM50052219
Substrate
Meas. Tech.
ChEMBL_1455651 (CHEMBL3365680)
IC50
1900±n/a nM
Citation
 Akrami, HMirjalili, BFKhoobi, MNadri, HMoradi, ASakhteman, AEmami, SForoumadi, AShafiee, A Indolinone-based acetylcholinesterase inhibitors: synthesis, biological activity and molecular modeling. Eur J Med Chem 84:375-81 (2014)  
Target
Name:
Cholinesterase
Synonyms:
BCHE CHLE_HORSE | Cholinesterase
Type:
Enzyme
Mol. Mass.:
65643.35
Organism:
Equus caballus (Horse)
Description:
P81908
Residue:
574
  
Inhibitor
Name:
BDBM50052219
Synonyms:
CHEMBL3318407
Type:
Small organic molecule
Emp. Form.:
C21H16BrClN2O
Mol. Mass.:
427.722
SMILES:
[Cl-].Brc1ccc(C[n+]2ccc(\C=C3\C(=O)Nc4ccccc34)cc2)cc1
: