Target
L-lactate dehydrogenase B chain
Ligand
BDBM50052406
Substrate
Meas. Tech.
ChEMBL_1456606 (CHEMBL3369988)
IC50
7800±n/a nM
Citation
 Dragovich, PSFauber, BPBoggs, JChen, JCorson, LBDing, CZEigenbrot, CGe, HGiannetti, AMHunsaker, TLabadie, SLi, CLiu, YLiu, YMa, SMalek, SPeterson, DPitts, KEPurkey, HERobarge, KSalphati, LSideris, SUltsch, MVanderPorten, EWang, JWei, BXu, QYen, IYue, QZhang, HZhang, XZhou, A Identification of substituted 3-hydroxy-2-mercaptocyclohex-2-enones as potent inhibitors of human lactate dehydrogenase. Bioorg Med Chem Lett 24:3764-71 (2014)  
Target
Name:
L-lactate dehydrogenase B chain
Synonyms:
L-lactate dehydrogenase B LDH heart subunit LDH-H LDHB_HUMAN Renal carcinoma antigen NY-REN-46
Type:
Oxidoreductase; homotetramer
Mol. Mass.:
36635.55
Organism:
Homo sapiens (Human)
Description:
Residue:
334
  
Inhibitor
Name:
BDBM50052406
Synonyms:
CHEMBL3318484
Type:
Small organic molecule
Emp. Form.:
C21H19NO2S
Mol. Mass.:
349.446
SMILES:
Cc1cccc(C)c1C1CC(O)=C(Sc2ccccc2C#N)C(=O)C1
: