Target
Malate dehydrogenase, cytoplasmic
Ligand
BDBM50052254
Substrate
Meas. Tech.
ChEMBL_1456624 (CHEMBL3370224)
IC50
>100000±n/a nM
Citation
 Dragovich, PSFauber, BPBoggs, JChen, JCorson, LBDing, CZEigenbrot, CGe, HGiannetti, AMHunsaker, TLabadie, SLi, CLiu, YLiu, YMa, SMalek, SPeterson, DPitts, KEPurkey, HERobarge, KSalphati, LSideris, SUltsch, MVanderPorten, EWang, JWei, BXu, QYen, IYue, QZhang, HZhang, XZhou, A Identification of substituted 3-hydroxy-2-mercaptocyclohex-2-enones as potent inhibitors of human lactate dehydrogenase. Bioorg Med Chem Lett 24:3764-71 (2014)  
Target
Name:
Malate dehydrogenase, cytoplasmic
Synonyms:
Cytosolic malate dehydrogenase MDHA Malate dehydrogenase cytoplasmic | Malate dehydrogenase, cytoplasmic
Type:
PROTEIN
Mol. Mass.:
36427.72
Organism:
Homo sapiens (Human)
Description:
ChEMBL_1456624
Residue:
334
  
Inhibitor
Name:
BDBM50052254
Synonyms:
2',6'-dichloro-4-((2-chlorophenyl)thio)-5-hydroxy-1,6-dihydro-[1,1'-biphenyl]-3(2H)-one (3) | CHEMBL3318469
Type:
Small organic molecule
Emp. Form.:
C18H13Cl3O2S
Mol. Mass.:
399.719
SMILES:
OC1=C(Sc2ccccc2Cl)C(=O)CC(C1)c1c(Cl)cccc1Cl
: