Target
Poly(ADP-ribose) glycohydrolase
Ligand
BDBM50052837
Substrate
Meas. Tech.
ChEMBL_1458454 (CHEMBL3370340)
IC50
15400±n/a nM
Citation
 Islam, RKoizumi, FKodera, YInoue, KOkawara, TMasutani, M Design and synthesis of phenolic hydrazide hydrazones as potent poly(ADP-ribose) glycohydrolase (PARG) inhibitors. Bioorg Med Chem Lett 24:3802-6 (2014)  
Target
Name:
Poly(ADP-ribose) glycohydrolase
Synonyms:
PARG_RAT Poly(ADP-ribose) glycohydrolase
Type:
PROTEIN
Mol. Mass.:
109006.89
Organism:
Rattus norvegicus
Description:
ChEMBL_109458
Residue:
972
  
Inhibitor
Name:
BDBM50052837
Synonyms:
CHEMBL3318749
Type:
Small organic molecule
Emp. Form.:
C17H16N4O8
Mol. Mass.:
404.3309
SMILES:
Oc1cc(\C=N\NC(=O)CC(=O)N\N=C\c2cc(O)c(O)c(O)c2)cc(O)c1O
: