Target
Poly(ADP-ribose) glycohydrolase
Ligand
BDBM50053038
Substrate
Meas. Tech.
ChEMBL_1458454 (CHEMBL3370340)
IC50
>75000±n/a nM
Citation
 Islam, RKoizumi, FKodera, YInoue, KOkawara, TMasutani, M Design and synthesis of phenolic hydrazide hydrazones as potent poly(ADP-ribose) glycohydrolase (PARG) inhibitors. Bioorg Med Chem Lett 24:3802-6 (2014)  
Target
Name:
Poly(ADP-ribose) glycohydrolase
Synonyms:
PARG_RAT Poly(ADP-ribose) glycohydrolase
Type:
PROTEIN
Mol. Mass.:
109006.89
Organism:
Rattus norvegicus
Description:
ChEMBL_109458
Residue:
972
  
Inhibitor
Name:
BDBM50053038
Synonyms:
CHEMBL3318735
Type:
Small organic molecule
Emp. Form.:
C22H18N4O6
Mol. Mass.:
434.4015
SMILES:
Oc1ccc(\C=N\NC(=O)c2ccc(cc2)C(=O)N\N=C\c2ccc(O)cc2O)c(O)c1
: