Target
Serine/threonine-protein kinase Chk1
Ligand
BDBM50389803
Substrate
Meas. Tech.
ChEMBL_1458470 (CHEMBL3370356)
IC50
7.9±n/a nM
Citation
 Song, PPeng, PHan, MCao, XMa, XLiu, TZhou, YHu, Y Design, synthesis and biological evaluation of thienopyridinones as Chk1 inhibitors. Bioorg Med Chem 22:4882-92 (2014)  
Target
Name:
Serine/threonine-protein kinase Chk1
Synonyms:
CHEK1 CHK1 checkpoint homolog Checkpoint kinase-1 (CHK1)
Type:
Enzyme Catalytic Domain
Mol. Mass.:
54443.02
Organism:
Homo sapiens (Human)
Description:
gi_166295192
Residue:
476
  
Inhibitor
Name:
BDBM50389803
Synonyms:
AZD7762 | CHEMBL2041933
Type:
Small organic molecule
Emp. Form.:
C17H19FN4O2S
Mol. Mass.:
362.422
SMILES:
NC(=O)Nc1cc(sc1C(=O)N[C@H]1CCCNC1)-c1cccc(F)c1
: