Target
Sodium-dependent dopamine transporter
Ligand
BDBM60507
Substrate
Meas. Tech.
ChEMBL_1450414 (CHEMBL3379358)
IC50
5.8±n/a nM
Citation
 Liu, SZha, CNacro, KHu, MCui, WYang, YLBhatt, USambandam, AIsherwood, MYet, LHerr, MTEbeltoft, SHassler, CFleming, LPechulis, ADPayen-Fornicola, AHolman, NMilanowski, DCotterill, IMozhaev, VKhmelnitsky, YGuzzo, PRSargent, BJMolino, BFOlson, RKing, DLelas, SLi, YWJohnson, KMolski, TOrie, ANg, AHaskell, RClarke, WBertekap, RO'Connell, JLodge, NSinz, MAdams, SZaczek, RMacor, JE Design and synthesis of 4-heteroaryl 1,2,3,4-tetrahydroisoquinolines as triple reuptake inhibitors. ACS Med Chem Lett 5:760-5 (2014)  
Target
Name:
Sodium-dependent dopamine transporter
Synonyms:
DA transporter DAT1 Dopamine transporter protein (DAT) SC6A3_HUMAN Sodium-dependent dopamine transporter Solute carrier family 6 member 3
Type:
Multi-pass membrane protein
Mol. Mass.:
68497.11
Organism:
Homo sapiens (Human)
Description:
Q01959
Residue:
620
  
Inhibitor
Name:
BDBM60507
Synonyms:
BDBM50054521 | US9085531, 75
Type:
Emp. Form.:
C22H24N2OS
Mol. Mass.:
364.504
SMILES:
CN1CC(c2cc3ccccc3s2)c2ccc(cc2C1)N1CCOCC1
: