Target
Carbonic anhydrase 2
Ligand
BDBM50054647
Substrate
Meas. Tech.
ChEMBL_1453079 (CHEMBL3362528)
Ki
3.9±n/a nM
Citation
 Pichake, JKharkar, PSCeruso, MSupuran, CTToraskar, MP Carbonic anhydrase inhibitors: design, synthesis, and biological evaluation of novel sulfonyl semicarbazide derivatives. ACS Med Chem Lett 5:793-6 (2014)  
Target
Name:
Carbonic anhydrase 2
Synonyms:
CA-II CAC Carbonate dehydratase II Carbonic anhydrase 2 (CA-II) Carbonic anhydrase C Carbonic anhydrase II (CA-II) Carbonic anhydrase II (hCA II) | Carbonic anhydrase isoenzyme II (hCA II)
Type:
Enzyme
Mol. Mass.:
29250.71
Organism:
Homo sapiens (Human)
Description:
P00918
Residue:
260
  
Inhibitor
Name:
BDBM50054647
Synonyms:
CHEMBL3323208
Type:
Small organic molecule
Emp. Form.:
C13H13BrN4O5S2
Mol. Mass.:
449.3
SMILES:
NS(=O)(=O)c1ccc(NC(=O)NNS(=O)(=O)c2ccc(Br)cc2)cc1
: