Target
Carbonic anhydrase 1
Ligand
BDBM50054653
Substrate
Meas. Tech.
ChEMBL_1453078 (CHEMBL3362527)
Ki
53±n/a nM
Citation
 Pichake, JKharkar, PSCeruso, MSupuran, CTToraskar, MP Carbonic anhydrase inhibitors: design, synthesis, and biological evaluation of novel sulfonyl semicarbazide derivatives. ACS Med Chem Lett 5:793-6 (2014)  
Target
Name:
Carbonic anhydrase 1
Synonyms:
CA-I CAB Carbonate dehydratase I Carbonic anhydrase 1 (CA I) Carbonic anhydrase 1 (Recombinant CA I) Carbonic anhydrase B Carbonic anhydrase I (CA I) Carbonic anhydrase I (CAI) Carbonic anhydrase isoenzyme I (hCA I) | hCA
Type:
Enzyme
Mol. Mass.:
28873.37
Organism:
Homo sapiens (Human)
Description:
P00915
Residue:
261
  
Inhibitor
Name:
BDBM50054653
Synonyms:
CHEMBL3323211
Type:
Small organic molecule
Emp. Form.:
C13H12ClN5O7S2
Mol. Mass.:
449.847
SMILES:
NS(=O)(=O)c1ccc(NC(=O)NNS(=O)(=O)c2ccc(Cl)c(c2)[N+]([O-])=O)cc1
: