Target
Phosphatidylinositol 4,5-bisphosphate 3-kinase catalytic subunit gamma isoform
Ligand
BDBM25072
Substrate
Meas. Tech.
ChEMBL_1453986 (CHEMBL3366680)
IC50
37±n/a nM
Citation
 Taha, MOAl-Sha'er, MAKhanfar, MAAl-Nadaf, AH Discovery of nanomolar phosphoinositide 3-kinase gamma (PI3Kż) inhibitors using ligand-based modeling and virtual screening followed by in vitro analysis. Eur J Med Chem 84:454-65 (2014)  
Target
Name:
Phosphatidylinositol 4,5-bisphosphate 3-kinase catalytic subunit gamma isoform
Synonyms:
PI3-kinase p110 subunit gamma PI3Kgamma PK3CG_HUMAN Phosphatidylinositol 4,5-bisphosphate 3-kinase (PI3K) Phosphatidylinositol 4,5-bisphosphate 3-kinase catalytic subunit gamma (PI3Kgamma) Phosphatidylinositol 4,5-bisphosphate 3-kinase catalytic subunit gamma isoform (PI3K) Phosphatidylinositol-4,5-bisphosphate 3-kinase catalytic subunit gamma isoform Phosphoinositide 3-kinases gamma (PI3K gamma) p120-PI3K
Type:
Enzyme Subunit
Mol. Mass.:
126470.30
Organism:
Homo sapiens (Human)
Description:
P48736
Residue:
1102
  
Inhibitor
Name:
BDBM25072
Synonyms:
4-[2-(4-methylphenyl)ethyl]-6-{[(5Z)-4-oxo-2-sulfanylidene-1,3-thiazolidin-5-ylidene]methyl}-3,4-dihydro-2H-1,4-benzoxazin-3-one | benzo[1,4]oxazin-3-one, 10n
Type:
Small organic molecule
Emp. Form.:
C21H18N2O3S2
Mol. Mass.:
410.509
SMILES:
Cc1ccc(CCN2C(=O)COc3ccc(\C=C4/SC(=S)NC4=O)cc23)cc1
: