Target
Cannabinoid receptor 2
Ligand
BDBM50055450
Substrate
Meas. Tech.
ChEMBL_1450470 (CHEMBL3379966)
Ki
202±n/a nM
Citation
 Brizzi, AAiello, FMarini, PCascio, MGCorelli, FBrizzi, VDe Petrocellis, LLigresti, ALuongo, LLamponi, SMaione, SPertwee, RGDi Marzo, V Structure-affinity relationships and pharmacological characterization of new alkyl-resorcinol cannabinoid receptor ligands: Identification of a dual cannabinoid receptor/TRPA1 channel agonist. Bioorg Med Chem 22:4770-83 (2014)  
Target
Name:
Cannabinoid receptor 2
Synonyms:
CANNABINOID CB2 CB2 CB2B CNR2_HUMAN Cannabinoid CB2 receptor Cannabinoid receptor 2 (CB2R) | hCB2
Type:
G Protein-Coupled Receptor (GPCR)
Mol. Mass.:
39690.94
Organism:
Homo sapiens (Human)
Description:
P34972
Residue:
360
  
Inhibitor
Name:
BDBM50055450
Synonyms:
CHEMBL3323686
Type:
Small organic molecule
Emp. Form.:
C29H43NO3
Mol. Mass.:
453.6566
SMILES:
CCCCCc1cc(O)cc(OCCCCCCCCCCC(=O)NCc2ccccc2)c1
: