Target
Cannabinoid receptor 1
Ligand
BDBM50055434
Substrate
Meas. Tech.
ChEMBL_1450469 (CHEMBL3379965)
Ki
1782±n/a nM
Citation
 Brizzi, AAiello, FMarini, PCascio, MGCorelli, FBrizzi, VDe Petrocellis, LLigresti, ALuongo, LLamponi, SMaione, SPertwee, RGDi Marzo, V Structure-affinity relationships and pharmacological characterization of new alkyl-resorcinol cannabinoid receptor ligands: Identification of a dual cannabinoid receptor/TRPA1 channel agonist. Bioorg Med Chem 22:4770-83 (2014)  
Target
Name:
Cannabinoid receptor 1
Synonyms:
CANN6 CB-R CNR CNR1_HUMAN Cannabinoid receptor Cannabinoid receptor 1 (brain)
Type:
G Protein-Coupled Receptor (GPCR)
Mol. Mass.:
52868.96
Organism:
Homo sapiens (Human)
Description:
P21554
Residue:
472
  
Inhibitor
Name:
BDBM50055434
Synonyms:
CHEMBL3323693
Type:
Small organic molecule
Emp. Form.:
C27H46N2O3
Mol. Mass.:
446.6657
SMILES:
CCCCCc1cc(O)cc(OCCCCCCCCCCC(=O)NN2CCCCC2)c1
: