Target
Monocarboxylate transporter 1
Ligand
BDBM50055506
Substrate
Meas. Tech.
ChEMBL_1451367 (CHEMBL3363651)
IC50
116±n/a nM
Citation
 Wang, HYang, CDoherty, JRRoush, WRCleveland, JLBannister, TD Synthesis and structure-activity relationships of pteridine dione and trione monocarboxylate transporter 1 inhibitors. J Med Chem 57:7317-24 (2014)  
Target
Name:
Monocarboxylate transporter 1
Synonyms:
MCT 1 MOT1_HUMAN SLC16A1 | Solute carrier family 16 member 1
Type:
PROTEIN
Mol. Mass.:
53956.64
Organism:
Homo sapiens (Human)
Description:
ChEMBL_1451367
Residue:
500
  
Inhibitor
Name:
BDBM50055506
Synonyms:
CHEMBL3326270
Type:
Small organic molecule
Emp. Form.:
C27H30N4O3
Mol. Mass.:
458.5521
SMILES:
CC(C)Cn1c2nc(Cc3cccc4ccccc34)c(\C=C/CCCO)nc2c(=O)n(C)c1=O
: