Target
D(4) dopamine receptor
Ligand
BDBM50055520
Substrate
Meas. Tech.
ChEMBL_1452246 (CHEMBL3366158)
Ki
49±n/a nM
Citation
 Sampson, DBricker, BZhu, XYPeprah, KLamango, NSSetola, VRoth, BLAblordeppey, SY Further evaluation of the tropane analogs of haloperidol. Bioorg Med Chem Lett 24:4294-7 (2014)  
Target
Name:
D(4) dopamine receptor
Synonyms:
D(4) dopamine receptor DOPAMINE D4.4 Dopamine receptor | Drd4
Type:
Enzyme Catalytic Domain
Mol. Mass.:
41307.65
Organism:
RAT
Description:
DOPAMINE D4.4 0 RAT::P30729
Residue:
387
  
Inhibitor
Name:
BDBM50055520
Synonyms:
CHEMBL3321789
Type:
Small organic molecule
Emp. Form.:
C22H25ClFNO2
Mol. Mass.:
389.891
SMILES:
OC1(CC2CCC(C1)N2CCCOc1ccc(F)cc1)c1ccc(Cl)cc1
: