Target
5-hydroxytryptamine receptor 2C
Ligand
BDBM21398
Substrate
Meas. Tech.
ChEMBL_1452249 (CHEMBL3366161)
Ki
4700±n/a nM
Citation
 Sampson, DBricker, BZhu, XYPeprah, KLamango, NSSetola, VRoth, BLAblordeppey, SY Further evaluation of the tropane analogs of haloperidol. Bioorg Med Chem Lett 24:4294-7 (2014)  
Target
Name:
5-hydroxytryptamine receptor 2C
Synonyms:
5-HT2C 5-hydroxytryptamine receptor 2C (5HT2c) 5ht1c Htr2c Serotonin receptor 2a and 2c (5HT2A and 5HT2C)
Type:
Enzyme
Mol. Mass.:
51935.10
Organism:
Rattus norvegicus (Rat)
Description:
P08909
Residue:
460
  
Inhibitor
Name:
BDBM21398
Synonyms:
4-[4-(4-Chloro-phenyl)-4-hydroxy-piperidin-1-yl]-1-(4-fluoro-phenyl)-butan-1-one;propionate(HCl) CHEMBL54 Haloperidol | Haloperidol, 1
Type:
Small organic molecule
Emp. Form.:
C21H23ClFNO2
Mol. Mass.:
375.864
SMILES:
OC1(CCN(CCCC(=O)c2ccc(F)cc2)CC1)c1ccc(Cl)cc1
: