Target
5-hydroxytryptamine receptor 2A
Ligand
BDBM50055521
Substrate
Meas. Tech.
ChEMBL_1452241 (CHEMBL3366153)
Ki
89±n/a nM
Citation
 Sampson, DBricker, BZhu, XYPeprah, KLamango, NSSetola, VRoth, BLAblordeppey, SY Further evaluation of the tropane analogs of haloperidol. Bioorg Med Chem Lett 24:4294-7 (2014)  
Target
Name:
5-hydroxytryptamine receptor 2A
Synonyms:
5-HT-2 5-HT2A 5-hydroxytryptamine receptor 2A (5HT-2A) 5HT2A_HUMAN HTR2A | Serotonin receptor 2A
Type:
undefined
Mol. Mass.:
52607.65
Organism:
Homo sapiens (Human)
Description:
P28223
Residue:
471
  
Inhibitor
Name:
BDBM50055521
Synonyms:
CHEMBL3321790
Type:
Small organic molecule
Emp. Form.:
C22H25ClFNOS
Mol. Mass.:
405.956
SMILES:
OC1(CC2CCC(C1)N2CCCSc1ccc(F)cc1)c1ccc(Cl)cc1
: