Target
Sodium-dependent noradrenaline transporter
Ligand
BDBM50362866
Substrate
Meas. Tech.
ChEMBL_1452255 (CHEMBL3366167)
Ki
1225±n/a nM
Citation
 Sampson, DBricker, BZhu, XYPeprah, KLamango, NSSetola, VRoth, BLAblordeppey, SY Further evaluation of the tropane analogs of haloperidol. Bioorg Med Chem Lett 24:4294-7 (2014)  
Target
Name:
Sodium-dependent noradrenaline transporter
Synonyms:
Monoamine transporter NET Noradrenaline Transporter (NET) Norepinephrine transporter protein (NET) SLC6A2 Sodium-dependent noradrenaline transporter (NET) | Solute carrier family 6 member 2
Type:
Multi-pass membrane protein
Mol. Mass.:
69337.72
Organism:
Homo sapiens (Human)
Description:
P23975
Residue:
617
  
Inhibitor
Name:
BDBM50362866
Synonyms:
CHEMBL1940402
Type:
Small organic molecule
Emp. Form.:
C21H25ClFNO
Mol. Mass.:
361.881
SMILES:
OC1(CCN(CCCCc2ccc(F)cc2)CC1)c1ccc(Cl)cc1
: