Target
Microtubule-associated protein tau
Ligand
BDBM15236
Substrate
Meas. Tech.
ChEMBL_1459450 (CHEMBL3368556)
IC50
<3000±n/a nM
Citation
 Fuse, SMatsumura, KFujita, YSugimoto, HTakahashi, T Development of dual targeting inhibitors against aggregations of amyloid-ß and tau protein. Eur J Med Chem 85:228-34 (2014)  
Target
Name:
Microtubule-associated protein tau
Synonyms:
MAPT MTBT1 Neurofibrillary tangle protein Paired helical filament-tau TAU_HUMAN | Tau Protein
Type:
Protein
Mol. Mass.:
78928.63
Organism:
Homo sapiens (Human)
Description:
P10636
Residue:
758
  
Inhibitor
Name:
BDBM15236
Synonyms:
3,5,7-trihydroxy-2-(3,4,5-trihydroxyphenyl)-4H-chromen-4-one CHEMBL164 Myricetin Myricetin (Myr) | cid_5281672
Type:
Small organic molecule
Emp. Form.:
C15H10O8
Mol. Mass.:
318.2351
SMILES:
Oc1cc(O)c2c(c1)oc(-c1cc(O)c(O)c(O)c1)c(O)c2=O
: