Target
Microtubule-associated protein tau
Ligand
BDBM26655
Substrate
Meas. Tech.
ChEMBL_1459450 (CHEMBL3368556)
IC50
<3000±n/a nM
Citation
 Fuse, SMatsumura, KFujita, YSugimoto, HTakahashi, T Development of dual targeting inhibitors against aggregations of amyloid-ß and tau protein. Eur J Med Chem 85:228-34 (2014)  
Target
Name:
Microtubule-associated protein tau
Synonyms:
MAPT MTBT1 Neurofibrillary tangle protein Paired helical filament-tau TAU_HUMAN | Tau Protein
Type:
Protein
Mol. Mass.:
78928.63
Organism:
Homo sapiens (Human)
Description:
P10636
Residue:
758
  
Inhibitor
Name:
BDBM26655
Synonyms:
2-(3,4-dihydroxyphenyl)-3,5,7,8-tetrahydroxy-4H-chromen-4-one Gossypetin (23) | gossypetin
Type:
Flavonoid
Emp. Form.:
C15H10O8
Mol. Mass.:
318.2351
SMILES:
Oc1ccc(cc1O)-c1oc2c(O)c(O)cc(O)c2c(=O)c1O
: