Target
Mu-type opioid receptor
Ligand
BDBM50055972
Substrate
Meas. Tech.
ChEMBL_1460275 (CHEMBL3370191)
Ki
>100000±n/a nM
Citation
 Cheng, MFOu, LCChen, SCChang, WTLaw, PYLoh, HHChao, YSShih, CYeh, SHUeng, SH Discovery, structure-activity relationship studies, and anti-nociceptive effects of 1-phenyl-3,6,6-trimethyl-1,5,6,7-tetrahydro-4H-indazol-4-one as novel opioid receptor agonists. Bioorg Med Chem 22:4694-703 (2014)  
Target
Name:
Mu-type opioid receptor
Synonyms:
MOR-1 Mu-type opioid receptor (MOR) OPRM_RAT Opioid receptor B Ror-b
Type:
G Protein-Coupled Receptor (GPCR)
Mol. Mass.:
44503.11
Organism:
Rattus norvegicus (rat)
Description:
Competition binding assays were carried out using membrane preparations from transfected HN9.10 cells that constitutively expressed the mu opioid receptor.
Residue:
398
  
Inhibitor
Name:
BDBM50055972
Synonyms:
CHEMBL3325710
Type:
Small organic molecule
Emp. Form.:
C17H19ClN2O
Mol. Mass.:
302.799
SMILES:
Cc1nn(c2CC(C)(C)CC(=O)c12)-c1ccc(Cl)cc1C
: