Target
Glucose-dependent insulinotropic receptor
Ligand
BDBM50055995
Substrate
Meas. Tech.
ChEMBL_1447042 (CHEMBL3374948)
EC50
14±n/a nM
Citation
 Buzard, DJKim, SHLehmann, JHan, SCalderon, IWong, AKawasaki, ANarayanan, SBhat, RGharbaoui, TLopez, LYue, DWhelan, KAl-Shamma, HUnett, DJShu, HHTung, SFChang, SChuang, CFMorgan, MSadeque, AChu, ZLLeonard, JNJones, RM Discovery and optimization of 5-fluoro-4,6-dialkoxypyrimidine GPR119 agonists. Bioorg Med Chem Lett 24:4332-5 (2014)  
Target
Name:
Glucose-dependent insulinotropic receptor
Synonyms:
G-protein coupled receptor 119 (GPR119) GPR119 | Glucose-dependent insulinotropic receptor
Type:
Protein
Mol. Mass.:
36901.49
Organism:
Homo sapiens (Human)
Description:
Q8TDV5
Residue:
335
  
Inhibitor
Name:
BDBM50055995
Synonyms:
CHEMBL3325845
Type:
Small organic molecule
Emp. Form.:
C21H25FN4O6S
Mol. Mass.:
480.51
SMILES:
Cc1nc(ccc1Oc1ncnc(OC2CCN(CC2)C(=O)OC2CCC2)c1F)S(C)(=O)=O
: