Target
Acetylcholinesterase
Ligand
BDBM50056121
Substrate
Meas. Tech.
ChEMBL_1447977 (CHEMBL3379803)
Ki
24±n/a nM
Citation
 Sun, QPeng, DYYang, SGZhu, XLYang, WCYang, GF Syntheses of coumarin-tacrine hybrids as dual-site acetylcholinesterase inhibitors and their activity against butylcholinesterase, Aß aggregation, andß-secretase. Bioorg Med Chem 22:4784-91 (2014)  
Target
Name:
Acetylcholinesterase
Synonyms:
ACES_HUMAN Acetylcholinesterase (AChE) | Acetylcholinesterase (human AChE)
Type:
Enzyme
Mol. Mass.:
67792.70
Organism:
Homo sapiens (Human)
Description:
P22303
Residue:
614
  
Inhibitor
Name:
BDBM50056121
Synonyms:
CHEMBL3326706
Type:
Small organic molecule
Emp. Form.:
C30H33N3O4
Mol. Mass.:
499.6007
SMILES:
COc1ccc2oc(=O)c(cc2c1)C(=O)NCCCCCCNc1c2CCCCc2nc2ccccc12
: