Target
Aurora kinase B
Ligand
BDBM50056192
Substrate
Meas. Tech.
ChEMBL_1448009 (CHEMBL3380433)
IC50
218±n/a nM
Citation
 Jagtap, ADChang, PTLiu, JRWang, HCKondekar, NBShen, LJTseng, HWChen, GSChern, JW Novel acylureidoindolin-2-one derivatives as dual Aurora B/FLT3 inhibitors for the treatment of acute myeloid leukemia. Eur J Med Chem 85:268-88 (2014)  
Target
Name:
Aurora kinase B
Synonyms:
AIK2 AIM1 ARK2 AURKB_HUMAN Aurora B-INCENP Aurora kinase B (AURKB) STK-1 STK12 Serine/threonine-protein kinase aurora B
Type:
Protein
Mol. Mass.:
39327.72
Organism:
Homo sapiens (Human)
Description:
Q96GD4
Residue:
344
  
Inhibitor
Name:
BDBM50056192
Synonyms:
CHEMBL3329677
Type:
Small organic molecule
Emp. Form.:
C29H29FN4O6
Mol. Mass.:
548.5622
SMILES:
CCOC(=O)CCc1c(C)[nH]c(\C=C2/C(=O)Nc3cc(NC(=O)NC(=O)c4ccc(OC)cc4F)ccc23)c1C
: