Target
Receptor-type tyrosine-protein kinase FLT3
Ligand
BDBM50056186
Substrate
Meas. Tech.
ChEMBL_1448010 (CHEMBL3380434)
IC50
676±n/a nM
Citation
 Jagtap, ADChang, PTLiu, JRWang, HCKondekar, NBShen, LJTseng, HWChen, GSChern, JW Novel acylureidoindolin-2-one derivatives as dual Aurora B/FLT3 inhibitors for the treatment of acute myeloid leukemia. Eur J Med Chem 85:268-88 (2014)  
Target
Name:
Receptor-type tyrosine-protein kinase FLT3
Synonyms:
CD135 FL cytokine receptor FLK2 FLT3 Fetal liver kinase-2 Fms-like tyrosine kinase 3 (Flt-3) STK-1 Stem cell tyrosine kinase 1
Type:
Enzyme
Mol. Mass.:
112888.62
Organism:
Homo sapiens (Human)
Description:
P36888
Residue:
993
  
Inhibitor
Name:
BDBM50056186
Synonyms:
CHEMBL3329656
Type:
Small organic molecule
Emp. Form.:
C21H15ClN4O3
Mol. Mass.:
406.822
SMILES:
Clc1ccc(cc1)C(=O)NC(=O)Nc1ccc2\C(=C\c3ccc[nH]3)C(=O)Nc2c1
: